{"text_format":"1","workbook":"xlsx","n_sheets":4,"sheets":["Instructions","Pre-Application Form","Application (Forms 1 and 2)","Customized Measures (Form 3)"],"not_rendered":{"charts":0,"images":6,"macros":1,"external_links":0,"defined_names":5,"comments":0,"pivot_tables":0},"unopened":[],"bounds":{"document_bytes":16777216,"sheet_cells":100000,"rows_first":2000,"rows_last":500,"rows_between":2000,"halvings":0,"cell_chars":16384,"cell_head_chars":4096},"cells_cut":0,"cells_raw":0,"read":"whole","date_system":"1900"}

{"sheet":"Instructions","index":0,"n_rows":32,"n_cols":34,"rows_kept":32,"cut":false,"hidden":false,"merged":[[19,2,21,8],[24,11,24,12],[10,2,10,5]]}
[]
[]
[null,null,null,null,"2018 Energy Efficiency Business Incentive Application"]
[]
[]
[]
[]
[]
[null,"Submit your completed application to: "]
[]
[null,null,"BusinessEnergySavings@sdge.com"]
[null,null,"    OR"]
[null,null,"San Diego Gas & Electric® "]
[null,null,"8335 Century Park Court, CP12C"]
[null,null,"San Diego, CA 92123-1569"]
[]
[]
[null,"Project Application"]
[]
[null,null,"Please complete all information in the Pre-Application Form, next sign and submit as soon as possible.  \nThen continue with the completion of Forms 1 and 2 & Form 3 as the project lifecycle progresses.  Both the customer and sponsor must sign the Pre-Application Form and the completed Application. The project sponsor is the primary contact acting as the responsible party for the application. A customer may choose to \"self-sponsor\" or have a third party serve as project sponsor."]
{"$rows_left_out":13}
{"sheet":"Pre-Application Form","index":1,"n_rows":73,"n_cols":46,"rows_kept":73,"cut":false,"hidden":false,"merged":[[60,0,60,26],[62,37,62,52],[55,0,56,52],[72,0,74,52],[65,0,65,26],[66,0,66,52],[67,0,67,52],[68,0,68,52],[69,0,69,52],[64,0,64,26],[64,31,64,40],[44,0,44,52],[61,0,61,52],[62,0,62,21],[62,22,62,36],[45,2,45,52],[46,2,46,52],[47,2,47,52],[48,2,48,52],[49,2,49,52],[51,0,53,52],[50,0,50,52],[57,0,57,21],[57,22,57,36],[57,37,57,52],[59,0,59,26],[59,31,59,40],[36,0,36,33],[36,35,36,51],[38,0,38,16],[38,18,38,33],[41,0,41,52],[29,0,29,19],[29,45,29,52],[31,0,31,52],[32,0,32,52],[34,0,34,25],[34,27,34,39],[34,41,34,43],[34,45,34,52],[25,0,25,25],[25,27,25,39],[25,41,25,52],[27,0,27,10],[27,12,27,22],[27,24,27,32],[27,34,27,42],[27,44,27,52],[20,0,20,52],[21,0,21,52],[23,0,23,25],[23,27,23,39],[23,41,23,43],[23,45,23,52],[16,3,16,9],[16,10,16,26],[16,31,16,35],[16,43,16,51],[19,0,19,54],[13,0,13,16],[13,18,13,34],[13,36,13,52],[15,3,15,9],[15,10,15,26],[15,31,15,35],[15,39,15,43],[11,0,11,25],[11,27,11,52],[12,0,12,16],[12,18,12,34],[12,36,12,52],[9,0,9,25],[9,27,9,39],[9,41,9,43],[10,0,10,25],[10,27,10,52],[5,0,5,52],[6,0,6,34],[7,0,7,52],[8,0,8,25],[8,27,8,39],[8,41,8,43],[8,45,8,52],[0,0,0,52],[1,0,1,52],[2,0,2,52],[3,0,3,52],[4,0,4,52]]}
["2018 Pre-Application Information Form"]
["Completed Pre-Application Information Forms should be submitted to the customer's \nassigned Account Executive, with a copy also sent to BusinessEnergySavings@sdge.com. If you are unsure who your Account Executive is, please contact the Business Call Center at 1-800-336-7343. "]
["PRIVACY NOTICE"]
["SDG&E® may be required to provide your information to the California Public Utilities Commission (CPUC) upon request.  If the CPUC requests review of your project, SDG&E will provide the CPUC with all information requested without further notification to you.  Upon submittal to the CPUC, SDG&E marks sensitive customer information as confidential and requests that this information be kept confidential.  If you do not want SDG&E to share your information with the CPUC, you must notify us within three (3) business days of the notice, and in such event, you will be prohibited from participating in the program."]
["CUSTOMER INFORMATION"]
["CUSTOMER / BUSINESS OWNER / BUILDER / DEVELOPER"]
[null,null,null,null,null,null,null,null,null,null,null,null,null,null,null,null,null,null,null,null,null,null,null,null,null,null,null,null,null,null,null,null,null,null,null,null,null,null,null,"Check if project has Proposition 39 funding"]
["Company Name (as it appears on utility bill)"]
[]
["Company Mailing Address",null,null,null,null,null,null,null,null,null,null,null,null,null,null,null,null,null,null,null,null,null,null,null,null,null,null,"City",null,null,null,null,null,null,null,null,null,null,null,null,null,"State",null,null,null,"Zip Code"]
[]
["Contact Name",null,null,null,null,null,null,null,null,null,null,null,null,null,null,null,null,null,null,null,null,null,null,null,null,null,null,"Title"]
[]
["Contact Telephone Number",null,null,null,null,null,null,null,null,null,null,null,null,null,null,null,null,null,"Contact Fax Number",null,null,null,null,null,null,null,null,null,null,null,null,null,null,null,null,null,"Email "]
["Tax Identification Type (Select Only One)",null,null,null,null,null,null,null,null,null,null,null,null,null,null,null,null,null,null,null,null,null,null,null,null,null,null,null,"Tax Status (Select Only One)"]
[null,null,null,"Federal Tax ID",null,null,null,null,null,null,null,null,null,null,null,null,null,null,null,null,null,null,null,null,null,null,null,null,null,null,null,"Corporation",null,null,null,null,null,null,null,"Individual"]
[null,null,null,"SSN",null,null,null,null,null,null,null,null,null,null,null,null,null,null,null,null,null,null,null,null,null,null,null,null,null,null,null,"Non-Corp",null,null,null,null,null,null,null,"Exempt"]
[null,null,null,null,null,null,null,null,null,null,null,null,null,null,null,null,null,null,null,null,null,null,null,null,null,null,null,null,null,null,null,null,null,null,null,null,null,null,null,null,null,null,null,"Exempt Reason"]
[]
[]
{"$rows_left_out":54}
{"sheet":"Application (Forms 1 and 2)","index":2,"n_rows":106,"n_cols":46,"rows_kept":106,"cut":false,"hidden":false,"merged":[[105,0,107,52],[3,39,3,52],[3,0,3,35],[0,13,0,52],[1,0,1,52],[2,0,2,52],[4,0,4,52],[5,0,5,25],[5,27,5,39],[5,41,5,43],[5,45,5,52],[6,0,6,25],[6,27,6,39],[6,41,6,43],[12,3,12,9],[12,10,12,26],[12,31,12,35],[12,39,12,43],[13,3,13,9],[13,31,13,35],[13,43,13,51],[24,0,24,10],[24,12,24,22],[13,10,13,26],[7,27,7,52],[10,0,10,16],[10,18,10,34],[10,36,10,52],[7,0,7,25],[8,0,8,25],[8,27,8,52],[9,0,9,16],[9,18,9,34],[9,36,9,52],[26,0,26,19],[26,45,26,52],[31,0,31,52],[32,0,32,52],[33,0,33,52],[35,0,35,25],[16,0,16,54],[18,0,18,52],[20,0,20,25],[20,27,20,39],[20,41,20,43],[20,45,20,52],[17,0,17,52],[22,27,22,39],[22,41,22,52],[35,27,35,39],[35,41,35,43],[28,26,28,52],[35,45,35,52],[24,24,24,32],[24,34,24,42],[24,44,24,52],[22,0,22,25],[37,0,37,33],[37,35,37,51],[56,0,56,52],[57,0,57,30],[57,32,57,41],[57,43,57,52],[44,44,44,51],[60,0,60,25],[60,27,60,39],[60,41,60,43],[60,45,60,49],[44,3,44,9],[44,10,44,26],[44,31,44,35],[55,0,55,52],[39,0,39,16],[39,18,39,33],[43,3,43,9],[43,10,43,26],[43,31,43,35],[43,39,43,43],[61,0,61,25],[61,27,61,36],[61,38,61,52],[58,0,58,30],[58,32,58,41],[58,43,58,52],[59,0,59,25],[59,27,59,39],[59,41,59,43],[59,45,59,52],[84,0,85,52],[86,0,86,52],[87,0,87,49],[88,0,88,26],[88,31,88,40],[62,0,62,25],[62,27,62,36],[62,38,62,49],[64,3,64,10],[64,31,64,35],[64,39,64,43],[65,3,65,9],[65,10,65,26],[65,31,65,35],[65,39,65,42],[65,43,65,51],[66,3,66,9],[66,10,66,26],[69,0,69,52],[70,0,72,52],[74,0,75,52],[77,0,77,52],[78,0,79,52],[81,0,81,52],[104,0,104,52],[95,0,95,52],[100,0,100,52],[103,0,103,52],[101,0,101,52],[102,0,102,52],[76,0,76,52],[82,0,82,52],[83,0,83,50],[91,37,91,52],[98,0,98,26],[98,31,98,40],[99,0,99,26],[96,0,96,21],[89,0,89,26],[90,0,90,52],[91,0,91,21],[91,22,91,36],[96,37,96,52],[93,0,93,26],[93,31,93,40],[96,22,96,36],[94,0,94,26]]}
[]
["CUSTOMER INFORMATION"]
["CUSTOMER / BUSINESS OWNER / BUILDER / DEVELOPER"]
[{"$f":"+'Pre-Application Form'!A7:AI7","v":0},null,null,null,null,null,null,null,null,null,null,null,null,null,null,null,null,null,null,null,null,null,null,null,null,null,null,null,null,null,null,null,null,null,null,null,null,null,null," Check if project has Prop 39 funding"]
["Company Name (as it appears on utility bill)"]
[{"$f":"+'Pre-Application Form'!A9:Z9","v":0},null,null,null,null,null,null,null,null,null,null,null,null,null,null,null,null,null,null,null,null,null,null,null,null,null,null,{"$f":"+'Pre-Application Form'!AB9:AN9","v":0},null,null,null,null,null,null,null,null,null,null,null,null,null,{"$f":"+'Pre-Application Form'!AP9:AR9","v":0},null,null,null,{"$f":"+'Pre-Application Form'!AT9:BA9","v":0}]
["Company Mailing Address",null,null,null,null,null,null,null,null,null,null,null,null,null,null,null,null,null,null,null,null,null,null,null,null,null,null,"City",null,null,null,null,null,null,null,null,null,null,null,null,null,"State",null,null,null,"Zip Code"]
[{"$f":"+'Pre-Application Form'!A11:Z11","v":0},null,null,null,null,null,null,null,null,null,null,null,null,null,null,null,null,null,null,null,null,null,null,null,null,null,null,{"$f":"+'Pre-Application Form'!AB11:BA11","v":0}]
["Contact Name",null,null,null,null,null,null,null,null,null,null,null,null,null,null,null,null,null,null,null,null,null,null,null,null,null,null,"Title"]
[{"$f":"+'Pre-Application Form'!A13:Q13","v":0},null,null,null,null,null,null,null,null,null,null,null,null,null,null,null,null,null,{"$f":"+'Pre-Application Form'!S13:AI13","v":0},null,null,null,null,null,null,null,null,null,null,null,null,null,null,null,null,null,{"$f":"+'Pre-Application Form'!AK13:BA13","v":0}]
["Contact Telephone Number",null,null,null,null,null,null,null,null,null,null,null,null,null,null,null,null,null,"Contact Fax Number",null,null,null,null,null,null,null,null,null,null,null,null,null,null,null,null,null,"Email "]
["Tax Identification Type (Select Only One)",null,null,null,null,null,null,null,null,null,null,null,null,null,null,null,null,null,null,null,null,null,null,null,null,null,null,null,"Tax Status (Select Only One)"]
[null,null,null,"Federal Tax ID",null,null,null,null,null,null,{"$f":"+'Pre-Application Form'!K16:AA16","v":0},null,null,null,null,null,null,null,null,null,null,null,null,null,null,null,null,null,null,null,null,"Corporation",null,null,null,null,null,null,null,"Individual"]
[null,null,null,"SSN",null,null,null,null,null,null,{"$f":"+'Pre-Application Form'!K17:AA17","v":0},null,null,null,null,null,null,null,null,null,null,null,null,null,null,null,null,null,null,null,null,"Non-Corp",null,null,null,null,null,null,null,"Exempt",null,null,null,{"$f":"+'Pre-Application Form'!AR17:AZ17","v":0}]
[null,null,null,null,null,null,null,null,null,null,null,null,null,null,null,null,null,null,null,null,null,null,null,null,null,null,null,null,null,null,null,null,null,null,null,null,null,null,null,null,null,null,null,"Exempt Reason"]
[]
[]
["PROJECT SITE INFORMATION (SITE OF RETROFIT / PROJECT)"]
[{"$f":"+'Pre-Application Form'!A22:BA22","v":0}]
["Project Name (name should include company name, site id and project description)"]
{"$rows_left_out":87}
{"sheet":"Customized Measures (Form 3)","index":3,"n_rows":72,"n_cols":109,"rows_kept":72,"cut":false,"hidden":false,"merged":[[40,10,40,12],[40,41,40,53],[41,41,41,53],[52,0,54,81],[42,41,42,53],[43,41,43,53],[44,0,45,81],[46,0,46,81],[47,0,47,81],[48,0,48,19],[48,51,48,55],[36,64,36,72],[36,73,36,81],[38,10,38,12],[38,16,38,28],[38,41,38,53],[38,71,38,78],[36,20,36,23],[39,16,39,28],[39,41,39,53],[39,59,39,81],[36,24,36,27],[36,28,36,29],[36,30,36,33],[36,34,36,38],[36,39,36,48],[36,49,36,51],[36,52,36,56],[36,57,36,63],[36,0,36,3],[36,4,36,6],[36,7,36,8],[36,9,36,11],[36,12,36,13],[36,14,36,19],[35,0,35,3],[35,4,35,6],[35,7,35,8],[35,9,35,11],[35,12,35,13],[35,73,35,81],[35,14,35,19],[35,20,35,23],[35,24,35,27],[35,28,35,29],[35,30,35,33],[35,34,35,38],[35,39,35,48],[35,49,35,51],[35,52,35,56],[35,57,35,63],[35,64,35,72],[33,73,33,81],[34,0,34,3],[34,4,34,6],[34,7,34,8],[34,9,34,11],[34,12,34,13],[34,14,34,19],[34,20,34,23],[34,24,34,27],[34,28,34,29],[34,30,34,33],[34,34,34,38],[34,39,34,48],[34,49,34,51],[34,52,34,56],[34,57,34,63],[34,64,34,72],[34,73,34,81],[32,30,32,33],[32,34,32,38],[32,39,32,48],[32,49,32,51],[32,52,32,56],[32,57,32,63],[32,64,32,72],[32,73,32,81],[33,0,33,3],[33,4,33,6],[33,7,33,8],[33,9,33,11],[33,12,33,13],[33,14,33,19],[33,20,33,23],[33,24,33,27],[33,28,33,29],[33,30,33,33],[33,34,33,38],[33,39,33,48],[33,49,33,51],[33,52,33,56],[33,57,33,63],[33,64,33,72],[32,0,32,3],[32,4,32,6],[32,7,32,8],[32,9,32,11],[32,12,32,13],[32,14,32,19],[32,20,32,23],[32,24,32,27],[32,28,32,29],[27,0,27,48],[27,49,27,81],[28,0,31,3],[28,4,31,8],[28,9,31,13],[28,14,31,23],[28,24,31,29],[28,30,31,38],[28,39,31,48],[28,49,31,51],[28,52,31,56],[28,57,31,63],[28,64,31,72],[28,73,31,81],[21,1,21,19],[21,35,21,52],[21,53,21,61],[21,62,21,70],[21,71,21,78],[21,79,21,81],[22,1,22,19],[22,35,22,52],[22,53,22,61],[22,62,22,70],[22,71,22,78],[22,79,22,81],[19,1,19,19],[19,35,19,52],[19,53,19,61],[19,62,19,70],[19,71,19,78],[19,79,19,81],[20,1,20,19],[20,35,20,52],[20,53,20,61],[20,62,20,70],[20,71,20,78],[20,79,20,81],[5,96,6,96],[17,20,18,28],[17,29,18,34],[17,35,18,52],[17,53,18,61],[17,62,18,70],[0,23,0,49],[1,23,1,49],[2,6,2,37],[2,48,2,81],[3,14,3,28],[17,71,18,78],[17,79,18,81],[18,1,18,19],[17,0,17,19],[15,3,15,16]]}
[null,null,null,null,null,null,null,null,null,null,null,null,null,null,null,null,null,null,null,null,null,null,null,"San Diego Gas & Electric \n2018 Energy Efficiency Business Incentive Application"]
[null,null,null,null,null,null,null,null,null,null,null,null,null,null,null,null,null,null,null,null,null,null,null,"Customized Measures - FORM 3"]
[null,null,null,null,null,"Project Name",{"$f":"IF('Application (Forms 1 and 2)'!A19=\"\",\"\",'Application (Forms 1 and 2)'!A19)","v":0},null,null,null,null,null,null,null,null,null,null,null,null,null,null,null,null,null,null,null,null,null,null,null,null,null,null,null,null,null,null,null,null,null,null,null,null,null,null,null,null,"Project Sponsor",{"$f":"IF('Application (Forms 1 and 2)'!A34=0, \"\", 'Application (Forms 1 and 2)'!A34)","v":""}]
[null,null,null,null,null,null,null,null,null,null,null,null,null,"Estimated Installation Completion Date (MM/DD/YYYY):",null,null,null,null,null,null,null,null,null,null,null,null,null,null,null,null,null,null,null,null,null,null,null,null,null,null,null,null,null,null,null,"Customer Type:"]
[]
["Energy Efficiency Measure Information",null,null,null,null,null,null,null,null,null,null,null,null,null,null,null,null,null,null,null,null,null,null,null,null,null,null,null,null,null,null,null,null,null,null,null,null,null,null,null,null,null,null,null,null,null,null,null,null,null,null,null,null,null,null,null,null,null,null,null,null,null,null,null,null,null,null,null,null,null,null,null,null,null,null,null,null,null,null,null,null,null,null,null,null,null,null,null,null,null,null,null,null,null,null,null,"*partnership does not get kW","CR","SP"]
["If you need assistance completing this application, please contact your SDG&E account representative.",null,null,null,null,null,null,null,null,null,null,null,null,null,null,null,null,null,null,null,null,null,null,null,null,null,null,null,null,null,null,null,null,null,null,null,null,null,null,null,null,null,null,null,null,null,null,null,null,null,null,null,null,null,null,null,null,null,null,null,null,null,null,null,null,null,null,null,null,null,null,null,null,null,null,null,null,null,null,null,null,null,null,null,null,null,null,null,null,null,null,null,null,null,null,null,null,"cost cap","cost cap"]
["1. Indicate the Site Name and Account ID Number that will be affected by the measure. If the same measure is being installed at multiple sites, please create separate line items for each site.",null,null,null,null,null,null,null,null,null,null,null,null,null,null,null,null,null,null,null,null,null,null,null,null,null,null,null,null,null,null,null,null,null,null,null,null,null,null,null,null,null,null,null,null,null,null,null,null,null,null,null,null,null,null,null,null,null,null,null,null,null,null,null,null,null,null,null,null,null,null,null,null,null,null,null,null,null,null,null,null,null,null,null,null,null,null,null,null,null,null,null,null,null,null,"CR","SP"]
["2. Indicate the Technology Type by checking Basic Lighting, Targeted Lighting, Basic Non-Lighting, or Targeted Non-Lighting.",null,null,null,null,null,null,null,null,null,null,null,null,null,null,null,null,null,null,null,null,null,null,null,null,null,null,null,null,null,null,null,null,null,null,null,null,null,null,null,null,null,null,null,null,null,null,null,null,null,null,null,null,null,null,null,null,null,null,null,null,null,null,null,null,null,null,null,null,null,null,null,null,null,null,null,null,null,null,null,null,null,null,null,null,null,null,null,null,null,null,null,null,"Basic Lighting",1,0.12,0.24,0.5,0.5]
["3. Select the Measure Type. Choose ER if the measure is to be claimed as Early Retirement (e.g. if the equipment being replaced is still operational and capable of being operated for one additional year). Choose ROB if the measure is to be claimed as",null,null,null,null,null,null,null,null,null,null,null,null,null,null,null,null,null,null,null,null,null,null,null,null,null,null,null,null,null,null,null,null,null,null,null,null,null,null,null,null,null,null,null,null,null,null,null,null,null,null,null,null,null,null,null,null,null,null,null,null,null,null,null,null,null,null,null,null,null,null,null,null,null,null,null,null,null,null,null,null,null,null,null,null,null,null,null,null,null,null,null,null,"Basic Non-Lighting",2,0.12,0.24,0.5,0.8]
["    Replace on Burnout (e.g. if the equipment being replaced is not operational, or incapable of being operated for one additional year). Choose REA if the measure is to be claimed as Retrofit Add-On (e.g. if this is a controls measure or a mechanism added to existing",null,null,null,null,null,null,null,null,null,null,null,null,null,null,null,null,null,null,null,null,null,null,null,null,null,null,null,null,null,null,null,null,null,null,null,null,null,null,null,null,null,null,null,null,null,null,null,null,null,null,null,null,null,null,null,null,null,null,null,null,null,null,null,null,null,null,null,null,null,null,null,null,null,null,null,null,null,null,null,null,null,null,null,null,null,null,null,null,null,null,null,null,"Targeted Lighting",3,0.12,0.24,0.5,0.8]
[null,"equipment resulting in increased efficiency).",null,null,null,null,null,null,null,null,null,null,null,null,null,null,null,null,null,null,null,null,null,null,null,null,null,null,null,null,null,null,null,null,null,null,null,null,null,null,null,null,null,null,null,null,null,null,null,null,null,null,null,null,null,null,null,null,null,null,null,null,null,null,null,null,null,null,null,null,null,null,null,null,null,null,null,null,null,null,null,null,null,null,null,null,null,null,null,null,null,null,null,"Targeted Non-Lighting",4,0.12,0.24,0.5,0.8]
["    Choose NEW if the measure is to be claimed as New Load (e.g. Installation of new, high-efficiency equipment to meet expanded process needs or new production loads, that does not involve: Change in facility function/footprint, Movement of key equipment/",null,null,null,null,null,null,null,null,null,null,null,null,null,null,null,null,null,null,null,null,null,null,null,null,null,null,null,null,null,null,null,null,null,null,null,null,null,null,null,null,null,null,null,null,null,null,null,null,null,null,null,null,null,null,null,null,null,null,null,null,null,null,null,null,null,null,null,null,null,null,null,null,null,null,null,null,null,null,null,null,null,null,null,null,null,null,null,null,null,null,null,null,"Gas",5,1.25,1,0.5,0.8]
[null,"operations or Construction/removal of walls).",null,null,null,null,null,null,null,null,null,null,null,null,null,null,null,null,null,null,null,null,null,null,null,null,null,null,null,null,null,null,null,null,null,null,null,null,null,null,null,null,null,null,null,null,null,null,null,null,null,null,null,null,null,null,null,null,null,null,null,null,null,null,null,null,null,null,null,null,null,null,null,null,null,null,null,null,null,null,null,null,null,null,null,null,null,null,null,null,null,null,null,null,6]
[]
[null,null,null,"Enter data in blue cells"]
[]
["Calculated Measures",null,null,null,null,null,null,null,null,null,null,null,null,null,null,null,null,null,null,null,"Technology Type",null,null,null,null,null,null,null,null,"Measure Type",null,null,null,null,null,"Description of the Proposed Measure",null,null,null,null,null,null,null,null,null,null,null,null,null,null,null,null,null,"Full Measure Cost ($)*",null,null,null,null,null,null,null,null,"Incremental Meas. Cost ($)*",null,null,null,null,null,null,null,null,"Year Eqpt.\nInstalled",null,null,null,null,null,null,null,"Calculation Tool",null,null,null,null,null,null,null,null,null,null,null,null,null,"Measure Type","Measure Code"]
["#","Site Name (and Account ID# to be impacted by measure)",null,null,null,null,null,null,null,null,null,null,null,null,null,null,null,null,null,null,null,null,null,null,null,null,null,null,null,null,null,null,null,null,null,null,null,null,null,null,null,null,null,null,null,null,null,null,null,null,null,null,null,null,null,null,null,null,null,null,null,null,null,null,null,null,null,null,null,null,null,null,null,null,null,null,null,null,null,null,null,null,null,null,null,null,null,null,null,null,null,null,null,"ER",1]
[1,null,null,null,null,null,null,null,null,null,null,null,null,null,null,null,null,null,null,null,null,null,null,null,null,null,null,null,null,null,null,null,null,null,null,null,null,null,null,null,null,null,null,null,null,null,null,null,null,null,null,null,null,null,null,null,null,null,null,null,null,null,null,null,null,null,null,null,null,null,null,null,null,null,null,null,null,null,null,null,null,null,null,null,null,null,null,null,null,null,null,null,null,"ROB",2]
{"$rows_left_out":52}